Ms access project sql server failedemplois

Filtrer

Mes recherches récentes
Filtrer par :
Budget
à
à
à
Type
Compétences
Langues
    État du travail
    457 ms access project sql server failed travaux trouvés au tarif de EUR

    Was doing a Prestashop 1.6.1.8 upgrade (1 click upgrade) and after many it completed the entire site gave http 500 error. I think i did a backup on my work pc earlier today that i can provide. I need the site back to working and upgraded to new 1.7 version.

    €118 (Avg Bid)
    €118 Offre moyenne
    13 offres

    I switched from eclipse to studio. I imported a project in Android studio. I am unable to fix error gradle sync failed error

    €19 (Avg Bid)
    €19 Offre moyenne
    23 offres

    Seeking expert legal advice for a failed web project. I enlisted and signed a contract with a company based in India to deliver a web and application based site. Nearly 18 mths later we have a first phase website that has been riddled with errors and bugs and still no applications for delivery. We are no longer receiving responses from the development

    €539 (Avg Bid)
    €539 Offre moyenne
    12 offres

    ...authentication failed for user "postgres" $ rails s failed to read test/fixtures/..: Is a directory @ io_fillbuf - fd:11 test/fixtures/.. failed to read test/fixtures/.: Is a directory @ io_fillbuf - fd:12 test/fixtures/. => Booting WEBrick => Rails 4.2.7.1 application starting in development on http://localhost:3000 => Run `rails server -h` for ...

    €11 / hr (Avg Bid)
    €11 / hr Offre moyenne
    8 offres

    ...restart Job for [se connecter pour voir l'URL] failed. See 'systemctl status [se connecter pour voir l'URL]' and 'journalctl -xn' for details. # systemctl status [se connecter pour voir l'URL] ● [se connecter pour voir l'URL] - LSB: Apache2 web server Loaded: loaded (/etc/init.d/apache2) Drop-In: /lib/systemd/system/apache2.service.d ...

    €49 (Avg Bid)
    €49 Offre moyenne
    4 offres

    ...to them. We are seeking a company to finalise what they cannot. We have given them ample opportunity and they have failed miserably. It is not a complex app and a first version was completed but needed many improvements. They failed to provided a successful working edition of the improved version. I can provide further details for those that might

    €610 (Avg Bid)
    €610 Offre moyenne
    50 offres

    Hello, I have a virtual machine windows, I install virtual dj but I have a problem with the sound card and direct X. Direct X failed to [se connecter pour voir l'URL] install the correct driver for your video card Thank you

    €22 (Avg Bid)
    €22 Offre moyenne
    3 offres

    I have 15 log groups with multiple log streams. I can already retrieve information from 1 log group and multiple log streams using a filter pattern. What I want to do it automate this so that for the last week, I can execute a script that will retrieve 3 to 5 terms occurring in all the logs. We can use a for loop wrapper around the CloudWatch query.

    €215 (Avg Bid)
    €215 Offre moyenne
    5 offres

    When I try to access my WordPress admin url I get this php error: Re: {100-4264464} public_html/wp-admin/[se connecter pour voir l'URL]): failed to open stream: No such file or directory in /home/lionscreativeweb/public_html/wp-admin/[se connecter pour voir l'URL] on line 17 Fix any other errors. $10 to $20 max.

    €17 (Avg Bid)
    €17 Offre moyenne
    42 offres

    After adding Photo-viewer plugin, cannot build android version with Ionic project. Here's error log. $ ionic cordova build --release android ... BUILD FAILED in 12s 27 actionable tasks: 27 executed /.../platforms/android/gradlew: Command failed with exit code 1 Error output: Note: Some input files use or override a deprecated API. Note: Recompile

    €31 (Avg Bid)
    €31 Offre moyenne
    12 offres

    Please watch the following video. My translation file is full from Vietnamese to Japanese. But when clicking on the "edit information" link or other links below, you will be jumping back to the Vietnamese page. I want to go to Japanese page if I am in Japanese page. The translation file has already translated all but it doesn't show up but goes back to the Vietnamese page.

    €22 (Avg Bid)
    €22 Offre moyenne
    3 offres

    After the latest Wordpress update we are not able to update pages, it always says "Failed to update". Also, need help with the Google Maps API Key.

    €23 (Avg Bid)
    €23 Offre moyenne
    25 offres

    Mail delivery message failed error We are getting mailed delivery message failed when customer place there orders. Customers are not getting email confirmation this was working fine before however since change to vps dedicated server no email confirmation being received. This can be quick fix but not sure where to look. Thanks

    €21 (Avg Bid)
    €21 Offre moyenne
    26 offres

    we work with my TV (Teamviewer) for easy work.

    €26 (Avg Bid)
    €26 Offre moyenne
    16 offres

    the MySQL service has issues it keeps crashing on start and corrupting tables when restarted in repair mode it works, but as soon as repair mode is removed, and MySQL starts again, it crashes again

    €11 / hr (Avg Bid)
    €11 / hr Offre moyenne
    18 offres

    The server is using an adminpanel (froxlor) to handle all of the configuration. It is in production for a long time and for 5 out of 7 pages on the server php is working normally. But with 2 pages i have the following problem : FastCGI: failed to connect to server "/var/www/php-fpm/name/[se connecter pour voir l'URL]": connect() failed FastCGI: in...

    €28 (Avg Bid)
    €28 Offre moyenne
    15 offres

    i need how to get 503 instead of any other failure code change it all to 503

    €20 (Avg Bid)
    €20 Offre moyenne
    4 offres

    captcha will stop working if captcha is validated on the form but the validation of the form is triggered after the captcha validation is done.

    €20 (Avg Bid)
    €20 Offre moyenne
    24 offres

    ...ipdb> [se connecter pour voir l'URL]([se connecter pour voir l'URL]([se connecter pour voir l'URL][0], -1)) *** [se connecter pour voir l'URL]: Failed in nopython mode pipeline (step: nopython frontend) Invalid use of type(CPUDispatcher(<function rdist at 0x7f36c7ce4e18>...

    €107 (Avg Bid)
    €107 Offre moyenne
    7 offres

    good day I have a new magento 2 webshop that did not want to mail I have tried this This module works only with Magento 2.2.4/2.2.5 versions and need to be removed after upgrade/downgrade. Assumed that the issue will be fixed in the new release. 1. How to install module Install via composer Run the following command in Magento 2 root folder: composer require sashas/bug-from-email php bin/mage...

    €179 (Avg Bid)
    €179 Offre moyenne
    13 offres

    trying to upload productos to magento and i cant because i got this error after 70 seconds. ************ Error 503 Backend fetch failed Backend fetch failed Guru Meditation: XID: 1999504 Varnish cache server ******** also need to be checked timeout limits

    €19 (Avg Bid)
    €19 Offre moyenne
    15 offres

    Magento Cron script readiness check failed

    €23 (Avg Bid)
    €23 Offre moyenne
    15 offres

    I need node js and MongoDB on the amazon ec2. I have installed the node js and MongoDB. But Because of some reason, MongoDB is not able to connect. I need help from MongoDB admin who can help me in configuring MongoDB on aws ec2 instance. Please bid Only, if you are comfortable in working on a shared screen. I won't be able to give aws credential to you.

    €23 (Avg Bid)
    €23 Offre moyenne
    3 offres

    The application is failing cert verification for custom CA signed vcertificates

    €11 (Avg Bid)
    €11 Offre moyenne
    1 offres

    Hallo, My name is Alex. I have two small projects that I have built in Rhino and Houdini to 3D print. However, I am having trouble completing the project due to Booleans failing (crossed boundaries / unshared edges) Do you have some experience in Houdini? I will need these issues resolved ready for printing. I will also have more projects coming up

    €18 / hr (Avg Bid)
    €18 / hr Offre moyenne
    10 offres

    I am using mac osx high sierra. I get this error when i start a app "Creation failed: Unable to find Chrome executable" searchcode: [se connecter pour voir l'URL] Thank you.

    €24 (Avg Bid)
    €24 Offre moyenne
    2 offres

    C# project error Precondition Failed error on HTTP request Please bid if you know the problem : Max budget 15$

    €18 (Avg Bid)
    €18 Offre moyenne
    5 offres

    Hello, We have an application which connects to our websites mariadb for exchanging license information. But from few days we are getting above mentioned error. So we need to solve this quickly and urgently. So I have attached source file where error is occurs and if you need to debug whole source code then it can be done through teamviewer on my pc. Thank you.

    €2 / hr (Avg Bid)
    €2 / hr Offre moyenne
    1 offres

    Hello, When moving from one hosting to an other, my gallery2 script has been moved but don't work. I need help to fix this. Only apply if you know gallery2 script : [se connecter pour voir l'URL] Tx

    €32 (Avg Bid)
    €32 Offre moyenne
    17 offres

    It's failed to upload the image in the post as attached. Reminder: The uploaded file could not be moved to wp-content/uploads/2018/09. The folder writing is 755. It's okay to upload the image if I set the folder as 777.

    €20 (Avg Bid)
    €20 Offre moyenne
    37 offres

    [se connecter pour voir l'URL] https:/...com/store/apps/details?id=[se connecter pour voir l'URL] The apps above (same platform) are getting the "handshake failed" error for users of android 7.0. I need someone to fix this error for me on either the server or app side. I prefer a fix on the server side if possible.

    €154 (Avg Bid)
    €154 Offre moyenne
    18 offres

    we have a php mysql server running on the server and its used by our devices to send attendance data. When I use df command, the output says 61% disk is used but df -i shows 100% Inodes used. It shouldn't more than one hour job for someone who knows the stuff

    €106 (Avg Bid)
    €106 Offre moyenne
    7 offres

    From UI I would like to see an option for the user to select “re run failures”. If selected, when the original test set completes, we should automatically compile the test cases which were logged as FAIL, and automatically re-run FAIL test cases

    €217 (Avg Bid)
    €217 Offre moyenne
    5 offres

    After Restarting nginx (via systemctl): Job for [se connecter pour voir l'URL] failed because the control process exited with error code. See "systemctl status [se connecter pour voir l'URL]" and "jo urnalctl -xe" for details. Full written sinstractions how can we fix this issue in the future.

    €28 (Avg Bid)
    €28 Offre moyenne
    17 offres

    i have problem with my outlook. it seems very easy but i dont want make something wrong Failed to register VB Script DLL .. its says Reinstall or run Regsvr32,exe [se connecter pour voir l'URL] to self register.

    €33 (Avg Bid)
    €33 Offre moyenne
    3 offres

    I have a website down, and it's spitting this error. PHP Fatal error: require(): Failed opening required '/home2/officeca/public_html/wp-includes/rest-api/endpoints/[se connecter pour voir l'URL]' (include_path='.:/opt/alt/php70/usr/share/pear') in /home2/officeca/public_html/[se connecter pour voir l'URL] on line 238 Thanks!

    €22 (Avg Bid)
    €22 Offre moyenne
    52 offres

    We use bitbucket for repository. In the pipeline to deploy the code to another server, it reports the following error. It seems there's We need an expert in Laravel to help fix the issue. It seems we need to deploy project from scratch installing all dependencies? After this, we hope to establish long term collaborations. <1s + ssh -p 9222 -o

    €32 (Avg Bid)
    €32 Offre moyenne
    27 offres

    This is quite a small, quick project. I have a file that I am trying to run a CFD on through ANSYS that I need quite urgently, however when I try and mesh the file I get the error: "One or more entities failed to mesh. The mesh of the bodies containing these entities may not be up-to-date. However, meshing might be successful on the other entities"

    €18 / hr (Avg Bid)
    €18 / hr Offre moyenne
    17 offres

    This is quite a small, quick project. I have a file that I am trying to run a CFD on through ANSYS that I need quite urgently, however when I try and mesh the file I get the error: "One or more entities failed to mesh. The mesh of the bodies containing these entities may not be up-to-date. However, meshing might be successful on the other entities"

    €88 (Avg Bid)
    €88 Offre moyenne
    30 offres

    Redirect folder "Can not create folder "ServerNameRedirected_User_FilesUserNameDesktop" Error details: "Access is denied. OS: Windows 7 x64

    €109 (Avg Bid)
    €109 Offre moyenne
    37 offres

    Hello, i uploads media file to uploads folder on FTP but i still dont see it in media libelary, in articl...range for example 2-3 month but i see i got some error - it sounds like timeout becouse i have a lot of images. Whatever now i try to import only one month but i got error: Failed to import Media and a large list. example XML file in attachment

    €35 (Avg Bid)
    Garanti
    €35
    5 propositions

    You can see the error here: [se connecter pour voir l'URL] Site uses Yii, PHP and Mysql

    €22 (Avg Bid)
    €22 Offre moyenne
    10 offres

    import via plesk Job for [se connecter pour voir l'URL] failed because the control process exited with error code. See "systemctl status [se connecter pour voir l'URL]" and "journalctl -xe" for details. Unable to import the database_new dump: ERROR 1062 (23000) at line 12478: Duplicate entry 'i breeze 500 [0,127970,129113] -> [N] POST [se connecter pou...

    €46 (Avg Bid)
    €46 Offre moyenne
    14 offres

    import via plesk Job for [se connecter pour voir l'URL] failed because the control process exited with error code. See "systemctl status [se connecter pour voir l'URL]" and "journalctl -xe" for details. Unable to import the database_new dump: ERROR 1062 (23000) at line 12478: Duplicate entry 'i breeze 500 [0,127970,129113] -> [N] POST [se connecter pou...

    €26 (Avg Bid)
    €26 Offre moyenne
    4 offres

    [se connecter pour voir l'URL] is getting a "secure connection failed" error for some browsers: see: [se connecter pour voir l'URL]://[se connecter pour voir l'URL] I need help to fix this issue.

    €85 (Avg Bid)
    €85 Offre moyenne
    40 offres

    Only need fixe for gradle 4.4 synchronization . and build apps complete show on ui . just fixed it . if you are experience on it it just less than 20 mins . thank you

    €18 / hr (Avg Bid)
    €18 / hr Offre moyenne
    11 offres

    Hey! Can someone help me with this error? I am not able to start my react-native app. Android studio shows this error: "Failed to resolve: react-native" If I start the react-native app with the console, the error "Execution failed for task ':app:processDebugResources'." appears.

    €5 / hr (Avg Bid)
    €5 / hr Offre moyenne
    20 offres

    Error: /project/gradlew: Command failed with exit code 1 Error output: FAILURE: Build failed with an exception. A problem occurred configuring root project 'project'. Here is the exact error: Could not find [se connecter pour voir l'URL] ([se connecter pour voir l'URL]:play-services-auth-base-license:11.8.0). Searched in the following locat...

    €14 / hr (Avg Bid)
    €14 / hr Offre moyenne
    5 offres

    I need someone to configure my email server. It must be very simple but I do not know how to do it. Currently I get this error "550-No Such User Here 550 Sender verify failed" When I send an email from my server to hotmail, it bounces me; when I send to another domain I also reboot it, and gmail receives it but fails to identify the sender. And from

    €23 (Avg Bid)
    €23 Offre moyenne
    8 offres

    here's the error - I need you to fox this. I would but I do not have time - this is no more than 1 hour - do not bid if you think it will take more time because if you do you're unqualified to do the work. What would you like to do? ------------------------------------------------------------------------------- 1: Attempt to reinstall this existing certificate 2: Renew & replace the ...

    €23 (Avg Bid)
    €23 Offre moyenne
    6 offres